Target
Gamma-aminobutyric acid receptor subunit alpha-1
Ligand
BDBM540754
Substrate
Meas. Tech.
Steroid Inhibition of TBPS Binding
IC50
<10±n/a nM
Citation
 Martinez Botella, GHarrison, BLRobichaud, AJSalituro, FGBeresis, RT 19-NOR neuroactive steroids and methods of use thereof US Patent  US11261211 Publication Date 3/1/2022 
Target
Name:
Gamma-aminobutyric acid receptor subunit alpha-1
Synonyms:
Benzodiazepine central GABA A Benzodiazepine GABA A Benzodiazepine Type II GABA A Benzodiazepine Type IIM GABA A Benzodiazepine omega2 GABA A alpha1 GABA receptor alpha-1 subunit GABA-PICROTOXIN Gabra-1 TBPS
Type:
Enzyme
Mol. Mass.:
51770.21
Organism:
Rattus norvegicus (Rat)
Description:
P62813
Residue:
455
  
Inhibitor
Name:
BDBM540754
Synonyms:
US11261211, Compound SA-15
Type:
Small organic molecule
Emp. Form.:
C26H36N4O2
Mol. Mass.:
436.5896
SMILES:
C[C@]12CC[C@H]3[C@@H](CC[C@@H]4C[C@](C)(O)CC[C@H]34)[C@@H]1CC[C@@H]2C(=O)Cn1nnc2cccnc12
: