Target
Gamma-aminobutyric acid receptor subunit alpha-1
Ligand
BDBM540776
Substrate
Meas. Tech.
Steroid Inhibition of TBPS Binding
IC50
30±n/a nM
Citation
 Martinez Botella, GHarrison, BLRobichaud, AJSalituro, FGBeresis, RT 19-NOR neuroactive steroids and methods of use thereof US Patent  US11261211 Publication Date 3/1/2022 
Target
Name:
Gamma-aminobutyric acid receptor subunit alpha-1
Synonyms:
Benzodiazepine central GABA A Benzodiazepine GABA A Benzodiazepine Type II GABA A Benzodiazepine Type IIM GABA A Benzodiazepine omega2 GABA A alpha1 GABA receptor alpha-1 subunit GABA-PICROTOXIN Gabra-1 TBPS
Type:
Enzyme
Mol. Mass.:
51770.21
Organism:
Rattus norvegicus (Rat)
Description:
P62813
Residue:
455
  
Inhibitor
Name:
BDBM540776
Synonyms:
US11261211, Compound SB-45
Type:
Small organic molecule
Emp. Form.:
C28H39N3O3
Mol. Mass.:
465.6276
SMILES:
COC[C@@]1(O)CC[C@H]2[C@@H](CC[C@H]3[C@@H]4CC[C@H](C(=O)Cn5cc6ccncc6n5)[C@@]4(C)CC[C@H]23)C1
: