Target
Indoleamine 2,3-dioxygenase 1
Ligand
BDBM541775
Substrate
Meas. Tech.
Enzymatic Assay
IC50
15.5±n/a nM
Citation
 Boss, CBur, DCren, SKimmerlin, TLotz-Jenne, CPothier, JTidten-Luksch, N Inhibitors of indoleamine 2,3-dioxygenase and/or tryptophan 2,3-dioxygenase US Patent  US11267824 Publication Date 3/8/2022 
Target
Name:
Indoleamine 2,3-dioxygenase 1
Synonyms:
I23O1_HUMAN IDO-1 INDO Indoleamine 2,3-dioxygenase | Indoleamine-pyrrole 2,3-dioxygenase
Type:
Enzyme
Mol. Mass.:
45330.80
Organism:
Homo sapiens (Human)
Description:
P14902
Residue:
403
  
Inhibitor
Name:
BDBM541775
Synonyms:
US11267824, Example 4a
Type:
Small organic molecule
Emp. Form.:
C16H24N2OS
Mol. Mass.:
292.44
SMILES:
CC(C)c1sc2cncn2c1[C@@H](O)CC1CCCCC1
: