Target
Bcl-2-like protein 11 [51-76]/Induced myeloid leukemia cell differentiation protein Mcl-1 [171-327]
Ligand
BDBM542528
Substrate
Meas. Tech.
Bim Binding Assays (Mcl-1 TR-FRET Assays)
Ki
0.093±n/a nM
Citation
 Rescourio, GGonzalez Buenrostro, ABrown, SPLizarzaburu, MMedina, JJabri, SYSun, DSimonovich, SPYan, XLi, YRew, Y Alpha-hydroxy phenylacetic acid pharmacophore or bioisostere Mcl-1 protein antagonists US Patent  US11274105 Publication Date 3/15/2022 
Target
Name:
Bcl-2-like protein 11 [51-76]/Induced myeloid leukemia cell differentiation protein Mcl-1 [171-327]
Synonyms:
Bcl-2-like protein 11 [51-76]/Induced myeloid leukemia cell differentiation protein Mcl-1 [171-327] Mcl-1 and BIM | Mcl-1/BIM
Type:
Protein
Mol. Mass.:
Description:
Components:
This complex has 2 components.
Component 1
Name:
Induced myeloid leukemia cell differentiation protein Mcl-1 [171-327]
Synonyms:
BCL2L3 MCL1 Myeloid cell leukemia 1 (Mcl-1)
Type:
Enzyme Catalytic Domain
Mol. Mass.:
17896.13
Organism:
Homo sapiens (Human)
Description:
Q07820[171-327]
Residue:
157
  
Component 2
Name:
Bcl-2-like protein 11 [51-76]
Synonyms:
B2L11_HUMAN BIM Bcl-2-like protein 11 (BIM) (51-76)
Type:
Enzyme Catalytic Domain
Mol. Mass.:
2530.22
Organism:
Homo sapiens (Human)
Description:
O43521[51-76]
Residue:
26
  
Inhibitor
Name:
BDBM542528
Synonyms:
(1S,3′R,6′R,7′S,8′E,15′R)-6-CHLORO-N-(CYCLOPROPYLSULFONYL)-15′-HYDROXY-7′-METHOXY-12′-METHYL-13′-OXO-3,4-DIHYDRO-2H-SPIRO[NAPHTHALENE-1,22′-[20]OXA[1,12]DIAZATETRACYCLO[14.7.2.03,6.019,24]PENTACOSA[8,16,18,24]TETRAENE]-15′-CARBOXAMIDE | US11274105, Example 15
Type:
Small organic molecule
Emp. Form.:
C37H46ClN3O7S
Mol. Mass.:
712.295
SMILES:
CO[C@H]1\C=C\CCN(C)C(=O)C[C@](O)(C(=O)NS(=O)(=O)C2CC2)c2ccc3OC[C@]4(CCCc5cc(Cl)ccc45)CN(C[C@@H]4CC[C@@H]14)c3c2
: