Target
Fibroblast growth factor receptor 4
Ligand
BDBM543013
Substrate
Meas. Tech.
FGFR4 Activity Inhibition Test
IC50
29.2±n/a nM
Citation
 Shao, NWang, DYuan, HKayser, F Aromatic derivative, preparation method for same, and medical applications thereof US Patent  US11279697 Publication Date 3/22/2022 
Target
Name:
Fibroblast growth factor receptor 4
Synonyms:
CD_antigen: CD334 FGFR4 FGFR4 Fibroblast growth factor receptor JK2 TKF
Type:
Protein
Mol. Mass.:
87957.45
Organism:
Homo sapiens (Human)
Description:
P22455
Residue:
802
  
Inhibitor
Name:
BDBM543013
Synonyms:
US11279697, Compound 093
Type:
Small organic molecule
Emp. Form.:
C24H23F2N3O3
Mol. Mass.:
439.4545
SMILES:
COc1cc(OC)c(F)c(C2CCc3c(C2)[nH]nc3-c2ccccc2NC(=O)C=C)c1F
: