Target
Fibroblast growth factor receptor 4
Ligand
BDBM543081
Substrate
Meas. Tech.
FGFR4 Activity Inhibition Test
IC50
1881±n/a nM
Citation
 Shao, NWang, DYuan, HKayser, F Aromatic derivative, preparation method for same, and medical applications thereof US Patent  US11279697 Publication Date 3/22/2022 
Target
Name:
Fibroblast growth factor receptor 4
Synonyms:
CD_antigen: CD334 FGFR4 FGFR4 Fibroblast growth factor receptor JK2 TKF
Type:
Protein
Mol. Mass.:
87957.45
Organism:
Homo sapiens (Human)
Description:
P22455
Residue:
802
  
Inhibitor
Name:
BDBM543081
Synonyms:
US11279697, Compound 113
Type:
Small organic molecule
Emp. Form.:
C21H20Cl2N4O3
Mol. Mass.:
447.314
SMILES:
COc1cc(OC)c(Cl)c(NCc2cc(n[nH]2)-c2ccccc2NC(=O)C=C)c1Cl
: