Target
Fibroblast growth factor receptor 4
Ligand
BDBM543084
Substrate
Meas. Tech.
FGFR4 Activity Inhibition Test
IC50
158±n/a nM
Citation
 Shao, NWang, DYuan, HKayser, F Aromatic derivative, preparation method for same, and medical applications thereof US Patent  US11279697 Publication Date 3/22/2022 
Target
Name:
Fibroblast growth factor receptor 4
Synonyms:
CD_antigen: CD334 FGFR4 FGFR4 Fibroblast growth factor receptor JK2 TKF
Type:
Protein
Mol. Mass.:
87957.45
Organism:
Homo sapiens (Human)
Description:
P22455
Residue:
802
  
Inhibitor
Name:
BDBM543084
Synonyms:
US11279697, Compound 114
Type:
Small organic molecule
Emp. Form.:
C24H24FN3O3
Mol. Mass.:
421.4641
SMILES:
COc1cc(OC)c(F)c(c1)C1CCc2c(C1)[nH]nc2-c1ccccc1NC(=O)C=C
: