Target
Fibroblast growth factor receptor 4
Ligand
BDBM543102
Substrate
Meas. Tech.
FGFR4 Activity Inhibition Test
IC50
2.96±n/a nM
Citation
 Shao, NWang, DYuan, HKayser, F Aromatic derivative, preparation method for same, and medical applications thereof US Patent  US11279697 Publication Date 3/22/2022 
Target
Name:
Fibroblast growth factor receptor 4
Synonyms:
CD_antigen: CD334 FGFR4 FGFR4 Fibroblast growth factor receptor JK2 TKF
Type:
Protein
Mol. Mass.:
87957.45
Organism:
Homo sapiens (Human)
Description:
P22455
Residue:
802
  
Inhibitor
Name:
BDBM543102
Synonyms:
US11279697, Compound 281-P2
Type:
Small organic molecule
Emp. Form.:
C22H23F2N5O3
Mol. Mass.:
443.4465
SMILES:
COc1cc(OC)c(F)c([C@H]2CCc3c(C2)[nH]nc3-c2c(NC(=O)C=C)cnn2C)c1F
: