Target
Fibroblast growth factor receptor 4
Ligand
BDBM543186
Substrate
Meas. Tech.
FGFR4 Activity Inhibition Test
IC50
2616±n/a nM
Citation
 Shao, NWang, DYuan, HKayser, F Aromatic derivative, preparation method for same, and medical applications thereof US Patent  US11279697 Publication Date 3/22/2022 
Target
Name:
Fibroblast growth factor receptor 4
Synonyms:
CD_antigen: CD334 FGFR4 FGFR4 Fibroblast growth factor receptor JK2 TKF
Type:
Protein
Mol. Mass.:
87957.45
Organism:
Homo sapiens (Human)
Description:
P22455
Residue:
802
  
Inhibitor
Name:
BDBM543186
Synonyms:
US11279697, Compound 285-P1
Type:
Small organic molecule
Emp. Form.:
C26H28Cl2N4O3
Mol. Mass.:
515.432
SMILES:
COc1cc(OC)c(Cl)c([C@@H]2CCc3c(C2)[nH]nc3-c2cc(ccc2NC(=O)C=C)N(C)C)c1Cl
: