Target
Fibroblast growth factor receptor 4
Ligand
BDBM543436
Substrate
Meas. Tech.
FGFR4 Activity Inhibition Test
IC50
236±n/a nM
Citation
 Shao, NWang, DYuan, HKayser, F Aromatic derivative, preparation method for same, and medical applications thereof US Patent  US11279697 Publication Date 3/22/2022 
Target
Name:
Fibroblast growth factor receptor 4
Synonyms:
CD_antigen: CD334 FGFR4 FGFR4 Fibroblast growth factor receptor JK2 TKF
Type:
Protein
Mol. Mass.:
87957.45
Organism:
Homo sapiens (Human)
Description:
P22455
Residue:
802
  
Inhibitor
Name:
BDBM543436
Synonyms:
US11279697, Compound 297
Type:
Small organic molecule
Emp. Form.:
C24H20Cl2FN3O3
Mol. Mass.:
488.338
SMILES:
COc1cc(OC)c(Cl)c(C2=Cc3[nH]nc(c3CC2)-c2cc(F)ccc2NC(=O)C=C)c1Cl
: