Target
Fibroblast growth factor receptor 4
Ligand
BDBM543450
Substrate
Meas. Tech.
FGFR4 Activity Inhibition Test
IC50
129±n/a nM
Citation
 Shao, NWang, DYuan, HKayser, F Aromatic derivative, preparation method for same, and medical applications thereof US Patent  US11279697 Publication Date 3/22/2022 
Target
Name:
Fibroblast growth factor receptor 4
Synonyms:
CD_antigen: CD334 FGFR4 FGFR4 Fibroblast growth factor receptor JK2 TKF
Type:
Protein
Mol. Mass.:
87957.45
Organism:
Homo sapiens (Human)
Description:
P22455
Residue:
802
  
Inhibitor
Name:
BDBM543450
Synonyms:
US11279697, Compound 311-P2
Type:
Small organic molecule
Emp. Form.:
C22H24ClN5O3
Mol. Mass.:
441.911
SMILES:
COc1cc(OC)c(Cl)c(c1)[C@H]1CCc2c(C1)[nH]nc2-c1c(NC(=O)C=C)cnn1C
: