Target
Bromodomain-containing protein 3 [51-123]
Ligand
BDBM543758
Substrate
Meas. Tech.
AlphaLisa Assay
IC50
196±n/a nM
Citation
 Upadhayaya, RSKethiri, RMadan, SRajaiah, SK Fused pyrimidine compounds as BRD4 and JAK2 dual inhibitors and methods for use thereof US Patent  US11279703 Publication Date 3/22/2022 
Target
Name:
Bromodomain-containing protein 3 [51-123]
Synonyms:
BRD3 Bromodomain-containing protein 3 (BRD3)(BD1) KIAA0043 | RING3L
Type:
Mol. Mass.:
8887.10
Organism:
Homo sapiens (Human)
Description:
BD1 (51-123 aa) of Q15059
Residue:
73
  
Inhibitor
Name:
BDBM543758
Synonyms:
US11279703, TABLE 6.348
Type:
Small organic molecule
Emp. Form.:
C29H32F2N6O2S2
Mol. Mass.:
598.73
SMILES:
CN(C)C1CCN(CC1)c1ccc(Nc2ncc3scc(-c4ccc(F)c(NS(=O)(=O)C5(C)CC5)c4)c3n2)cc1F
: