Target
Apolipoprotein(a)
Ligand
BDBM544454
Substrate
Meas. Tech.
In Vitro Apo(a) Binding Assay
IC50
2.13±0.159 nM
Citation
 Blanco, CLBuezo, NDPerez, JASanz Gil, GCSoler, JP Pyrrolidine compounds US Patent  US11286249 Publication Date 3/29/2022 
Target
Name:
Apolipoprotein(a)
Synonyms:
APOA_HUMAN LPA | Lp(a)
Type:
Protein
Mol. Mass.:
226526.93
Organism:
Human
Description:
P08519
Residue:
2040
  
Inhibitor
Name:
BDBM544454
Synonyms:
(2S)-3-[3-[[[3-[(2S)-2-Carboxy-2-[(3R)-pyrrolidin-3-yl]ethyl]phenyl]methylamino]methyl]phenyl]-2-[(3R)-pyrrolidin-3-yl]propanoic acid; trihydrochloride | US11286249, Example 3
Type:
Small organic molecule
Emp. Form.:
C28H37N3O4
Mol. Mass.:
479.6111
SMILES:
OC(=O)[C@@H](Cc1cccc(CNCc2cccc(C[C@@H]([C@H]3CCNC3)C(O)=O)c2)c1)C1CCNC1
: