Target
Apolipoprotein(a)
Ligand
BDBM544458
Substrate
Meas. Tech.
In Vitro Apo(a) Binding Assay
IC50
126±5.97 nM
Citation
 Blanco, CLBuezo, NDPerez, JASanz Gil, GCSoler, JP Pyrrolidine compounds US Patent  US11286249 Publication Date 3/29/2022 
Target
Name:
Apolipoprotein(a)
Synonyms:
APOA_HUMAN LPA | Lp(a)
Type:
Protein
Mol. Mass.:
226526.93
Organism:
Human
Description:
P08519
Residue:
2040
  
Inhibitor
Name:
BDBM544458
Synonyms:
(2R)-3-Phenyl-2-[(3S)-pyrrolidin-3-yl]propanoic acid; hydrochloride | US11286249, Example 18
Type:
Small organic molecule
Emp. Form.:
C13H17NO2
Mol. Mass.:
219.2796
SMILES:
OC(=O)[C@H](Cc1ccccc1)[C@@H]1CCNC1
: