Target
Epidermal growth factor receptor [L858R]
Ligand
BDBM112499
Substrate
Meas. Tech.
pEGFR assay
IC50
0.03±n/a nM
Citation
 Harald, EMark, PJuergen, RUlrich, RHeinz, SDirk, STobias, W SUBSTITUTED 1H-PYRAZOLO[4,3-C]PYRIDINES AND DERIVATIVES AS EGFR INHIBITORS WIPO 0:0 (2022) Target
Name:
Epidermal growth factor receptor [L858R]
Synonyms:
EGFR EGFR_HUMAN ERBB1 Epidermal growth factor receptor (L858R) HER1
Type:
Mol. Mass.:
134323.62
Organism:
Homo sapiens (Human)
Description:
P00533[L858R]
Residue:
1210
  
Inhibitor
Name:
BDBM112499
Synonyms:
DACOMITINIB WO2022090481, Example dacomitinib
Type:
Small organic molecule
Emp. Form.:
C24H25ClFN5O2
Mol. Mass.:
469.939
SMILES:
COc1cc2ncnc(Nc3ccc(F)c(Cl)c3)c2cc1NC(=O)\C=C\CN1CCCCC1
: