Target
Epidermal growth factor receptor [L858R]
Ligand
BDBM50160870
Substrate
Meas. Tech.
pEGFR assay
IC50
5.10±n/a nM
Citation
 Harald, EMark, PJuergen, RUlrich, RHeinz, SDirk, STobias, W SUBSTITUTED 1H-PYRAZOLO[4,3-C]PYRIDINES AND DERIVATIVES AS EGFR INHIBITORS WIPO 0:0 (2022) Target
Name:
Epidermal growth factor receptor [L858R]
Synonyms:
EGFR EGFR_HUMAN ERBB1 Epidermal growth factor receptor (L858R) HER1
Type:
Mol. Mass.:
134323.62
Organism:
Homo sapiens (Human)
Description:
P00533[L858R]
Residue:
1210
  
Inhibitor
Name:
BDBM50160870
Synonyms:
CHEMBL3787344 WO2022090481, Example nazartinib
Type:
Small organic molecule
Emp. Form.:
C26H31ClN6O2
Mol. Mass.:
495.016
SMILES:
CN(C)C\C=C\C(=O)N1CCCC[C@H](C1)n1c(NC(=O)c2ccnc(C)c2)nc2cccc(Cl)c12
: