Target
cAMP-specific 3',5'-cyclic phosphodiesterase 4D [380-741]
Ligand
BDBM549294
Substrate
Meas. Tech.
PDE4 Assay
IC50
30±n/a nM
Citation
 Larsen, JNielsen, SFAndersen, P Substituted tetrahydropyran dihydrothienopyrimidines and their use as phosphodiesterase inhibitors US Patent  US11299497 Publication Date 4/12/2022 
Target
Name:
cAMP-specific 3',5'-cyclic phosphodiesterase 4D [380-741]
Synonyms:
DPDE3 PDE4D_HUMAN cAMP-specific 3',5'-cyclic phosphodiesterase 4D [380-740]
Type:
Enzyme Catalytic Domain
Mol. Mass.:
41417.35
Organism:
Homo sapiens (Human)
Description:
aa 380-740
Residue:
361
  
Inhibitor
Name:
BDBM549294
Synonyms:
N-butyl-2-chloro-5- oxido-6,7-dihydro- thieno[3,2-d]pyrimi- din-5-ium-4-amine | US11299497, Example 9
Type:
Small organic molecule
Emp. Form.:
C18H28N4O2S
Mol. Mass.:
364.506
SMILES:
CN(CCC1CCOCC1)c1nc2CC[S@@+]([O-])c2c(NC2CCC2)n1
: