Target
cAMP-specific 3',5'-cyclic phosphodiesterase 4D [380-741]
Ligand
BDBM549298
Substrate
Meas. Tech.
PDE4 Assay
IC50
30±n/a nM
Citation
 Larsen, JNielsen, SFAndersen, P Substituted tetrahydropyran dihydrothienopyrimidines and their use as phosphodiesterase inhibitors US Patent  US11299497 Publication Date 4/12/2022 
Target
Name:
cAMP-specific 3',5'-cyclic phosphodiesterase 4D [380-741]
Synonyms:
DPDE3 PDE4D_HUMAN cAMP-specific 3',5'-cyclic phosphodiesterase 4D [380-740]
Type:
Enzyme Catalytic Domain
Mol. Mass.:
41417.35
Organism:
Homo sapiens (Human)
Description:
aa 380-740
Residue:
361
  
Inhibitor
Name:
BDBM549298
Synonyms:
1-[(2-chloro-5- oxido-6,7-dihydro- thieno[3,2-d]pyrimi- din-5-ium-4- yl)amino]cyclo- butane-carbonitrile | US11299497, Example 13
Type:
Small organic molecule
Emp. Form.:
C18H30N4O2S
Mol. Mass.:
366.521
SMILES:
CC[C@@H](C)Nc1nc(nc2CC[S@@+]([O-])c12)N(C)CCC1CCOCC1
: