Target
Atypical chemokine receptor 3
Ligand
BDBM549775
Substrate
Meas. Tech.
In Vitro Assay
IC50
5.00±n/a nM
Citation
 Aissaoui, HGuerry, PLehembre, FPothier, JPouzol, LRichard-Bildstein, SYuan, S Piperidine CXCR7 receptor modulators US Patent  US11306078 Publication Date 4/19/2022 
Target
Name:
Atypical chemokine receptor 3
Synonyms:
ACKR3 C-X-C chemokine receptor type 7 CMKOR1 CXCR-7 Chemokine orphan receptor 1 G-protein coupled receptor RDC1 homolog RDC-1 | RDC1
Type:
Enzyme
Mol. Mass.:
41498.84
Organism:
Homo sapiens (Human)
Description:
P25106
Residue:
362
  
Inhibitor
Name:
BDBM549775
Synonyms:
US11306078, Example 1.169 | rac-(3R*,4R*)-1-Cyclohexyl-4-{[5-(2,4,6-trifluoro-phenyl)-isoxazole-3- carbonyl]-amino}-piperidine-3-carboxylic acid (1-pyridin-2-yl-cyclopropyl)- amide
Type:
Small organic molecule
Emp. Form.:
C30H32F3N5O3
Mol. Mass.:
567.602
SMILES:
Fc1cc(F)c(-c2cc(no2)C(=O)N[C@@H]2CCN(C[C@H]2C(=O)NC2(CC2)c2ccccn2)C2CCCCC2)c(F)c1
: