Target
Atypical chemokine receptor 3
Ligand
BDBM549986
Substrate
Meas. Tech.
In Vitro Assay
IC50
4.00±n/a nM
Citation
 Aissaoui, HGuerry, PLehembre, FPothier, JPouzol, LRichard-Bildstein, SYuan, S Piperidine CXCR7 receptor modulators US Patent  US11306078 Publication Date 4/19/2022 
Target
Name:
Atypical chemokine receptor 3
Synonyms:
ACKR3 C-X-C chemokine receptor type 7 CMKOR1 CXCR-7 Chemokine orphan receptor 1 G-protein coupled receptor RDC1 homolog RDC-1 | RDC1
Type:
Enzyme
Mol. Mass.:
41498.84
Organism:
Homo sapiens (Human)
Description:
P25106
Residue:
362
  
Inhibitor
Name:
BDBM549986
Synonyms:
(3S,4S)-1-Cyclopropylmethyl-4-{[5-(2,4-difluoro-phenyl)-isoxazole-3- carbonyl]-amino}-piperidine-3-carboxylic acid (1-pyridin-2-yl-cyclopropyl)- amide | US11306078, Example 4.031
Type:
Small organic molecule
Emp. Form.:
C28H29F2N5O3
Mol. Mass.:
521.5584
SMILES:
Fc1ccc(-c2cc(no2)C(=O)N[C@H]2CCN(CC3CC3)C[C@@H]2C(=O)NC2(CC2)c2ccccn2)c(F)c1
: