Target
Three-prime repair exonuclease 1
Ligand
BDBM550466
Substrate
IC50
55000±n/a nM
Citation
 Letourneau, JJSelvarangan Elamparuthi, KHuang, CBommireddy Venkata, V Substituted pyrrolo[1,2-a]pyrazines and pyrrolo[1,2-a][1,4]diazepines as TREX1 inhibitors US Patent  US11306098 Publication Date 4/19/2022 
Target
Name:
Three-prime repair exonuclease 1
Synonyms:
3'-5' exonuclease TREX1 Trex1
Type:
Protein
Mol. Mass.:
33681.13
Organism:
Mouse
Description:
Q91XB0
Residue:
314
  
Inhibitor
Name:
BDBM550466
Synonyms:
US11306098, Example 32 | US11583538, Example 49
Type:
Small organic molecule
Emp. Form.:
C30H39N5O2
Mol. Mass.:
501.663
SMILES:
CC(C)C[C@@H](N1CCC(CCc2ccccc2)N2C[C@H](N)C[C@H]2C1=O)C(=O)NCc1ccc(cc1)C#N
: