Target
Adenosine receptor A2a
Ligand
BDBM550786
Substrate
Meas. Tech.
Adenosine A2a Receptor
IC50
0.230±n/a nM
Citation
 Lu, BWang, SShen, XHe, FTao, W Heteroaryl[4,3-C]pyrimidine-5-amine derivative, preparation method therefor, and medical uses thereof US Patent  US11312705 Publication Date 4/26/2022 
Target
Name:
Adenosine receptor A2a
Synonyms:
A2A adenosine receptor (hA2A) ADENOSINE A2 ADORA2 Adenosine A2A receptor (A2AAR)
Type:
G Protein-Coupled Receptor (GPCR)
Mol. Mass.:
44716.46
Organism:
Homo sapiens (Human)
Description:
P29274
Residue:
412
  
Inhibitor
Name:
BDBM550786
Synonyms:
8-(2-Methyl-6-(trifluoromethyl)pyridin-4-yl)-7-phenyl-[1,2,4]triazolo[4,3-c]pyrimidin-5-amine 1 | US11312705, Example 1
Type:
Small organic molecule
Emp. Form.:
C18H13F3N6
Mol. Mass.:
370.3312
SMILES:
Cc1cc(cc(n1)C(F)(F)F)-c1c(nc(N)n2cnnc12)-c1ccccc1
: