Target
Adenosine receptor A2a
Ligand
BDBM550802
Substrate
Meas. Tech.
Adenosine A2a Receptor
IC50
0.250±n/a nM
Citation
 Lu, BWang, SShen, XHe, FTao, W Heteroaryl[4,3-C]pyrimidine-5-amine derivative, preparation method therefor, and medical uses thereof US Patent  US11312705 Publication Date 4/26/2022 
Target
Name:
Adenosine receptor A2a
Synonyms:
A2A adenosine receptor (hA2A) ADENOSINE A2 ADORA2 Adenosine A2A receptor (A2AAR)
Type:
G Protein-Coupled Receptor (GPCR)
Mol. Mass.:
44716.46
Organism:
Homo sapiens (Human)
Description:
P29274
Residue:
412
  
Inhibitor
Name:
BDBM550802
Synonyms:
7-Phenyl-8-(7-(trifluoromethyl)-1H-indazol-5-yl)-[1,2,4]triazolo[4,3-c]pyrimidin-5-amine 9 | US11312705, Example 9
Type:
Small organic molecule
Emp. Form.:
C19H12F3N7
Mol. Mass.:
395.3407
SMILES:
Nc1nc(-c2ccccc2)c(-c2cc(c3[nH]ncc3c2)C(F)(F)F)c2nncn12
: