Target
Adenosine receptor A2a
Ligand
BDBM550817
Substrate
Meas. Tech.
Adenosine A2a Receptor
IC50
0.230±n/a nM
Citation
 Lu, BWang, SShen, XHe, FTao, W Heteroaryl[4,3-C]pyrimidine-5-amine derivative, preparation method therefor, and medical uses thereof US Patent  US11312705 Publication Date 4/26/2022 
Target
Name:
Adenosine receptor A2a
Synonyms:
A2A adenosine receptor (hA2A) ADENOSINE A2 ADORA2 Adenosine A2A receptor (A2AAR)
Type:
G Protein-Coupled Receptor (GPCR)
Mol. Mass.:
44716.46
Organism:
Homo sapiens (Human)
Description:
P29274
Residue:
412
  
Inhibitor
Name:
BDBM550817
Synonyms:
8-(2-Chloro-6-(trifluoromethyl)pyridin-4-yl)-7-phenyl-[1,2,4]triazolo[4,3-c]pyrimidin-5-amine 23 | US11312705, Example 23
Type:
Small organic molecule
Emp. Form.:
C17H10ClF3N6
Mol. Mass.:
390.75
SMILES:
Nc1nc(-c2ccccc2)c(-c2cc(Cl)nc(c2)C(F)(F)F)c2nncn12
: