Target
Hsp90 chaperone protein kinase-targeting subunit
Ligand
BDBM551748
Substrate
Meas. Tech.
FP-based equilibrium competition assay
EC50
464±n/a nM
Citation
 Brown, LEHuang, DSCowen, LEWhitesell, LMarcyk, P Hsp90 inhibitors and uses thereof US Patent  US11312722 Publication Date 4/26/2022 
Target
Name:
Hsp90 chaperone protein kinase-targeting subunit
Synonyms:
F5H9H0_CRYNB
Type:
Protein
Mol. Mass.:
57233.28
Organism:
Filobasidiella neoformans
Description:
F5H9H0
Residue:
505
  
Inhibitor
Name:
BDBM551748
Synonyms:
US11312722, Compound 38
Type:
Small organic molecule
Emp. Form.:
C28H28N4O4
Mol. Mass.:
484.5463
SMILES:
COc1ccc(Cn2nc(cc2Nc2cc(O)cc(O)c2C(=O)N2CCCC2)-c2ccccc2)cc1
: