Target
Epidermal growth factor receptor [669-770,'SVD',771-1210]
Ligand
BDBM552589
Substrate
Meas. Tech.
Exon20-mutant-EGFR(D770_N771insSVD) kinase assay
IC50
0.39±n/a nM
Citation
 Stephan, SFranziska, SVolker, SMarkus, BKeith, GUlrich, KG., MJDetlev, SUlf, BDaniel, KJens, SMatthew, MHeidi, GBethany, K N-[2-({4-[3-(ANILINO)-4-OXO-4,5,6,7-TETRAHYDRO-1H-PYRROLO[3,2-C]PYRIDIN-2-YL]PYRIDIN-3-YL)OXY)ETHYL]PROP-2-ENAMIDE DERIVATIVES AND SIMILAR COMPOUNDS AS EGFR INHIBITORS FOR THE TREATMENT OF CANCER WIPO 0:0 (2022) Target
Name:
Epidermal growth factor receptor [669-770,'SVD',771-1210]
Synonyms:
EGFR ERBB Epidermal growth factor receptor [669-769,''ASV'',770-1210] HER1
Type:
Enzyme Catalytic Domain
Mol. Mass.:
61473.15
Organism:
Homo sapiens (Human)
Description:
P00533[669-770,'SVD',771-1210]
Residue:
545
  
Inhibitor
Name:
BDBM552589
Synonyms:
N-[2-({4-[3-(3-fluoro-2-methylanilino)-4-oxo-4,5,6,7-tetrahydro-1H-pyrrolo[3,2-c]pyridin-2-yl]pyridin-3-yl}oxy)ethyl]prop-2-enamide | WO2022101184, Example 2
Type:
Small organic molecule
Emp. Form.:
C24H24FN5O3
Mol. Mass.:
449.4775
SMILES:
Cc1c(F)cccc1Nc1c([nH]c2CCNC(=O)c12)-c1ccncc1OCCNC(=O)C=C
: