Target
von Hippel-Lindau disease tumor suppressor
Ligand
BDBM552689
Substrate
Meas. Tech.
VHL HEK-293 BRET Assay
IC50
190±n/a nM
Citation
 Jakob, FHao, WJ., FW 1-(2-(4-CYCLOPROPYL-1H-1,2,3-TRIAZOL-1-YL)ACETYL)-4-HYDROXY-N-(BENZYL)PYRROLIDIN E-2-CARBOXAMIDE DERIVATIVES AS VHL INHIBITORS FOR THE TREATMENT OF ANEMIA AND CANCER WIPO 0:0 (2022) Target
Name:
von Hippel-Lindau disease tumor suppressor
Synonyms:
Protein G7 VHL_HUMAN Von Hippel-Lindau disease tumor suppressor protein (VBC) | pVHL
Type:
Protein
Mol. Mass.:
24136.87
Organism:
Homo sapiens (Human)
Description:
P40337
Residue:
213
  
Inhibitor
Name:
BDBM552689
Synonyms:
(2S,4R)-N-((R)-3-([l,l'-biphenyl]-4-yl)-l-amino-l-oxopropan-2-yl)-l-((S)-2-cyclobutyl-2-(4-cyclopropyl-lH-l,2,3-triazol-l-yl)acetyl)-4-hydroxypyrrolidine-2-carboxamide ( Compound 4) | WO2022103411, Example S4
Type:
Small organic molecule
Emp. Form.:
C31H36N6O4
Mol. Mass.:
556.6553
SMILES:
NC(=O)[C@@H](Cc1ccc(cc1)-c1ccccc1)NC(=O)C1C[C@@H](O)CN1C(=O)[C@H](C1CCC1)n1cc(nn1)C1CC1
: