Target
von Hippel-Lindau disease tumor suppressor
Ligand
BDBM552696
Substrate
Meas. Tech.
VHL HEK-293 BRET Assay
IC50
150±n/a nM
Citation
 Jakob, FHao, WJ., FW 1-(2-(4-CYCLOPROPYL-1H-1,2,3-TRIAZOL-1-YL)ACETYL)-4-HYDROXY-N-(BENZYL)PYRROLIDIN E-2-CARBOXAMIDE DERIVATIVES AS VHL INHIBITORS FOR THE TREATMENT OF ANEMIA AND CANCER WIPO 0:0 (2022) Target
Name:
von Hippel-Lindau disease tumor suppressor
Synonyms:
Protein G7 VHL_HUMAN Von Hippel-Lindau disease tumor suppressor protein (VBC) | pVHL
Type:
Protein
Mol. Mass.:
24136.87
Organism:
Homo sapiens (Human)
Description:
P40337
Residue:
213
  
Inhibitor
Name:
BDBM552696
Synonyms:
WO2022103411, Example S11
Type:
Small organic molecule
Emp. Form.:
C35H40N6O4
Mol. Mass.:
608.7299
SMILES:
CC(C)(C)[C@@H](C(=O)N1C[C@H](O)C[C@H]1C(=O)N[C@H](Cc1ccc(cc1)-c1ccccc1)C(N)=O)n1cc(Cc2ccccc2)nn1
: