Target
von Hippel-Lindau disease tumor suppressor
Ligand
BDBM552711
Substrate
Meas. Tech.
VHL HEK-293 BRET Assay
IC50
10.00±n/a nM
Citation
 Jakob, FHao, WJ., FW 1-(2-(4-CYCLOPROPYL-1H-1,2,3-TRIAZOL-1-YL)ACETYL)-4-HYDROXY-N-(BENZYL)PYRROLIDIN E-2-CARBOXAMIDE DERIVATIVES AS VHL INHIBITORS FOR THE TREATMENT OF ANEMIA AND CANCER WIPO 0:0 (2022) Target
Name:
von Hippel-Lindau disease tumor suppressor
Synonyms:
Protein G7 VHL_HUMAN Von Hippel-Lindau disease tumor suppressor protein (VBC) | pVHL
Type:
Protein
Mol. Mass.:
24136.87
Organism:
Homo sapiens (Human)
Description:
P40337
Residue:
213
  
Inhibitor
Name:
BDBM552711
Synonyms:
(2S,4R)-l-((S)-3,3-dimethyl-2-(4-(l-methylcyclopropyl)-lH-l,2,3-triazol-l-yl)butanoyl)-4-hydroxy-N-(4-(4-methylthiazol-5-yl)benzyl)pyrrolidine-2-carboxamide (Compound 29) | WO2022103411, Example S29
Type:
Small organic molecule
Emp. Form.:
C28H36N6O3S
Mol. Mass.:
536.689
SMILES:
Cc1ncsc1-c1ccc(CNC(=O)[C@@H]2C[C@@H](O)CN2C(=O)[C@@H](n2cc(nn2)C2(C)CC2)C(C)(C)C)cc1
: