Target
von Hippel-Lindau disease tumor suppressor
Ligand
BDBM552712
Substrate
Meas. Tech.
VHL HEK-293 BRET Assay
IC50
20±n/a nM
Citation
 Jakob, FHao, WJ., FW 1-(2-(4-CYCLOPROPYL-1H-1,2,3-TRIAZOL-1-YL)ACETYL)-4-HYDROXY-N-(BENZYL)PYRROLIDIN E-2-CARBOXAMIDE DERIVATIVES AS VHL INHIBITORS FOR THE TREATMENT OF ANEMIA AND CANCER WIPO 0:0 (2022) Target
Name:
von Hippel-Lindau disease tumor suppressor
Synonyms:
Protein G7 VHL_HUMAN Von Hippel-Lindau disease tumor suppressor protein (VBC) | pVHL
Type:
Protein
Mol. Mass.:
24136.87
Organism:
Homo sapiens (Human)
Description:
P40337
Residue:
213
  
Inhibitor
Name:
BDBM552712
Synonyms:
WO2022103411, Compound 30 | WO2022103411, Example S30A
Type:
Small organic molecule
Emp. Form.:
C29H34N6O3S
Mol. Mass.:
546.684
SMILES:
Cc1ncsc1-c1ccc(CNC(=O)[C@@H]2C[C@@H](O)CN2C(=O)[C@@H](n2cc(nn2)C2(CC2)C#C)C(C)(C)C)cc1
: