Target
von Hippel-Lindau disease tumor suppressor
Ligand
BDBM552724
Substrate
Meas. Tech.
VHL HEK-293 BRET Assay
IC50
110±n/a nM
Citation
 Jakob, FHao, WJ., FW 1-(2-(4-CYCLOPROPYL-1H-1,2,3-TRIAZOL-1-YL)ACETYL)-4-HYDROXY-N-(BENZYL)PYRROLIDIN E-2-CARBOXAMIDE DERIVATIVES AS VHL INHIBITORS FOR THE TREATMENT OF ANEMIA AND CANCER WIPO 0:0 (2022) Target
Name:
von Hippel-Lindau disease tumor suppressor
Synonyms:
Protein G7 VHL_HUMAN Von Hippel-Lindau disease tumor suppressor protein (VBC) | pVHL
Type:
Protein
Mol. Mass.:
24136.87
Organism:
Homo sapiens (Human)
Description:
P40337
Residue:
213
  
Inhibitor
Name:
BDBM552724
Synonyms:
(2S,4R)-N-((R)-3-([l,l'-biphenyl]-4-yl)-l-amino-l-oxopropan-2-yl)-l-((S)-2-(4-(furan-2-yl)-lH-l,2,3-triazol-l-yl)-3-methylbutanoyl)-4-hydroxypyrrolidine-2-carboxamide ( Compound 43 ) WO2022103411, Example S39
Type:
Small organic molecule
Emp. Form.:
C31H34N6O5
Mol. Mass.:
570.6389
SMILES:
CC(C)[C@@H](C(=O)N1C[C@H](O)C[C@H]1C(=O)N[C@H](Cc1ccc(cc1)-c1ccccc1)C(N)=O)n1cc(nn1)-c1ccco1
: