Target
von Hippel-Lindau disease tumor suppressor
Ligand
BDBM552726
Substrate
Meas. Tech.
VHL HEK-293 BRET Assay
IC50
10.00±n/a nM
Citation
 Jakob, FHao, WJ., FW 1-(2-(4-CYCLOPROPYL-1H-1,2,3-TRIAZOL-1-YL)ACETYL)-4-HYDROXY-N-(BENZYL)PYRROLIDIN E-2-CARBOXAMIDE DERIVATIVES AS VHL INHIBITORS FOR THE TREATMENT OF ANEMIA AND CANCER WIPO 0:0 (2022) Target
Name:
von Hippel-Lindau disease tumor suppressor
Synonyms:
Protein G7 VHL_HUMAN Von Hippel-Lindau disease tumor suppressor protein (VBC) | pVHL
Type:
Protein
Mol. Mass.:
24136.87
Organism:
Homo sapiens (Human)
Description:
P40337
Residue:
213
  
Inhibitor
Name:
BDBM552726
Synonyms:
(2S,4R)-l-((S)-2-(4-cyclopropyl-lH-l,2,3-triazol-l-yl)-3,3-dimethylbutanoyl)-N-((S)-l-(2'-fluoro-[l,l'-biphenyl]-4-yl)ethyl)-4-hydroxypyrrolidine-2-carboxamide (Compound 47) WO2022103411, Example S41
Type:
Small organic molecule
Emp. Form.:
C30H36FN5O3
Mol. Mass.:
533.6369
SMILES:
C[C@H](NC(=O)[C@@H]1C[C@@H](O)CN1C(=O)[C@@H](n1cc(nn1)C1CC1)C(C)(C)C)c1ccc(cc1)-c1ccccc1F
: