Target
Lys-gingipain
Ligand
BDBM453329
Substrate
Meas. Tech.
Inhibition Activity Assay
IC50
0.060±n/a nM
Citation
 Konradi, AWGalemmo, Jr., RADominy, SSLynch, CCHolsinger, LJ Ketone inhibitors of lysine gingipain US Patent  US11325884 Publication Date 5/10/2022 
Target
Name:
Lys-gingipain
Synonyms:
KGP_PORG3 kgp
Type:
Protein
Mol. Mass.:
187217.55
Organism:
Porphyromonas gingivalis
Description:
B2RLK2
Residue:
1723
  
Inhibitor
Name:
BDBM453329
Synonyms:
BDBM553832 | US10730826, Compound 47a
Type:
Small organic molecule
Emp. Form.:
C18H25F3N2O4
Mol. Mass.:
390.3973
SMILES:
COC(C)(C)C(=O)NC(CCCCN)C(=O)COc1c(F)ccc(F)c1F
: