Target
Protein mono-ADP-ribosyltransferase PARP6
Ligand
BDBM553942
Substrate
Meas. Tech.
Fluorescence Anisotropy Binding Assay
IC50
8200±n/a nM
Citation
 Johannes, JWHande, SMDegorce, SLPacker, MJ Chemical compounds US Patent  US11325906 Publication Date 5/10/2022 
Target
Name:
Protein mono-ADP-ribosyltransferase PARP6
Synonyms:
ADP-ribosyltransferase diphtheria toxin-like 17 PARP-6 PARP6_HUMAN | Poly [ADP-ribose] polymerase 6
Type:
PROTEIN
Mol. Mass.:
71130.07
Organism:
Homo sapiens (Human)
Description:
ChEMBL_107589
Residue:
630
  
Inhibitor
Name:
BDBM553942
Synonyms:
US11325906, Example 6
Type:
Small organic molecule
Emp. Form.:
C22H25ClN6O2
Mol. Mass.:
440.926
SMILES:
CCc1cc2ncc(CN3CCN(CC3)c3ccc(nc3Cl)C(=O)NC)cc2[nH]c1=O
: