Target
Protein mono-ADP-ribosyltransferase PARP6
Ligand
BDBM553962
Substrate
Meas. Tech.
Fluorescence Anisotropy Binding Assay
IC50
>100000±n/a nM
Citation
 Johannes, JWHande, SMDegorce, SLPacker, MJ Chemical compounds US Patent  US11325906 Publication Date 5/10/2022 
Target
Name:
Protein mono-ADP-ribosyltransferase PARP6
Synonyms:
ADP-ribosyltransferase diphtheria toxin-like 17 PARP-6 PARP6_HUMAN | Poly [ADP-ribose] polymerase 6
Type:
PROTEIN
Mol. Mass.:
71130.07
Organism:
Homo sapiens (Human)
Description:
ChEMBL_107589
Residue:
630
  
Inhibitor
Name:
BDBM553962
Synonyms:
US11325906, Example 25
Type:
Small organic molecule
Emp. Form.:
C22H25FN6O2
Mol. Mass.:
424.4713
SMILES:
CNC(=O)c1ccc(cn1)N1CCN(Cc2ccc3nc(CCF)c(=O)[nH]c3c2)CC1
: