Target
Transthyretin
Ligand
BDBM138358
Substrate
Meas. Tech.
Fluorescence Polarization Binding Assay
IC50
296±n/a nM
Citation
 Graef, IAAlhamadsheh, MM Identification of stabilizers of multimeric proteins US Patent  US11337935 Publication Date 5/24/2022 
Target
Name:
Transthyretin
Synonyms:
ATTR Prealbumin TTHY_HUMAN Transthyretin (TTR)
Type:
Enzyme
Mol. Mass.:
15884.31
Organism:
Homo sapiens (Human)
Description:
P02766
Residue:
147
  
Inhibitor
Name:
BDBM138358
Synonyms:
US10278929, Compound 7 US8877795, 7
Type:
Small organic molecule
Emp. Form.:
C14H17FN2O
Mol. Mass.:
248.296
SMILES:
Cc1n[nH]c(C)c1CCCOc1ccccc1F
: