Target
Transthyretin
Ligand
BDBM138360
Substrate
Meas. Tech.
Fluorescence Polarization Binding Assay
IC50
433±n/a nM
Citation
 Graef, IAAlhamadsheh, MM Identification of stabilizers of multimeric proteins US Patent  US11337935 Publication Date 5/24/2022 
Target
Name:
Transthyretin
Synonyms:
ATTR Prealbumin TTHY_HUMAN Transthyretin (TTR)
Type:
Enzyme
Mol. Mass.:
15884.31
Organism:
Homo sapiens (Human)
Description:
P02766
Residue:
147
  
Inhibitor
Name:
BDBM138360
Synonyms:
US10278929, Compound 10 US8877795, 10
Type:
Small organic molecule
Emp. Form.:
C14H14N2OS2
Mol. Mass.:
290.404
SMILES:
CC1(C)NC(=O)C(C#N)=C(SCc2ccccc2)S1
: