Target
Transthyretin
Ligand
BDBM554486
Substrate
Meas. Tech.
Fluorescence Polarization Binding Assay
IC50
586±n/a nM
Citation
 Graef, IAAlhamadsheh, MM Identification of stabilizers of multimeric proteins US Patent  US11337935 Publication Date 5/24/2022 
Target
Name:
Transthyretin
Synonyms:
ATTR Prealbumin TTHY_HUMAN Transthyretin (TTR)
Type:
Enzyme
Mol. Mass.:
15884.31
Organism:
Homo sapiens (Human)
Description:
P02766
Residue:
147
  
Inhibitor
Name:
BDBM554486
Synonyms:
US11337935, Compound 11
Type:
Small organic molecule
Emp. Form.:
C20H9N3O2
Mol. Mass.:
323.3044
SMILES:
O=C1C2=C(Oc3[nH]c4ccccc4c3C2(C#N)C#N)c2ccccc12
: