Target
Bcl2-associated agonist of cell death
Ligand
BDBM552911
Substrate
Meas. Tech.
Homogeneous Time Resolved Fluorescence (HTRF) Assay
IC50
>100±n/a nM
Citation
 Pinchman, JRHuang, PQBunker, KDSit, RKSamatar, AA Benzamide compounds US Patent  US11344546 Publication Date 5/31/2022 
Target
Name:
Bcl2-associated agonist of cell death
Synonyms:
BAD BBC6 Bcl-2-binding component 6 Bcl-XL/Bcl-2-associated death promoter Bcl2-L-8 | Bcl2-antagonist of cell death (BAD)
Type:
PROTEIN
Mol. Mass.:
18393.69
Organism:
Homo sapiens (Human)
Description:
ChEMBL_478760
Residue:
168
  
Inhibitor
Name:
BDBM552911
Synonyms:
2-(1H-pyrrolo[2,3-b]pyridin-5-yloxy)-4-(4-((4,4-dimethyl-2-(3-methylbicyclo[1.1.1]pentan-1-yl)cyclohex-1-enyl)methyl)piperazin-1-yl)-N-(4-((4-fluorotetrahydro-2H-pyran-4-yl)methylamino)-3-nitrophenylsulfonyl)benzamide US11344546, Example 15 | US11590126, Example 15
Type:
Small organic molecule
Emp. Form.:
C45H54FN7O7S
Mol. Mass.:
856.016
SMILES:
CC12CC(C1)(C2)C1=C(CN2CCN(CC2)c2ccc(C(=O)NS(=O)(=O)c3ccc(NCC4(F)CCOCC4)c(c3)[N+]([O-])=O)c(Oc3cnc4[nH]ccc4c3)c2)CCC(C)(C)C1
: