Target
Bcl2-associated agonist of cell death
Ligand
BDBM552931
Substrate
Meas. Tech.
Homogeneous Time Resolved Fluorescence (HTRF) Assay
IC50
<10±n/a nM
Citation
 Pinchman, JRHuang, PQBunker, KDSit, RKSamatar, AA Benzamide compounds US Patent  US11344546 Publication Date 5/31/2022 
Target
Name:
Bcl2-associated agonist of cell death
Synonyms:
BAD BBC6 Bcl-2-binding component 6 Bcl-XL/Bcl-2-associated death promoter Bcl2-L-8 | Bcl2-antagonist of cell death (BAD)
Type:
PROTEIN
Mol. Mass.:
18393.69
Organism:
Homo sapiens (Human)
Description:
ChEMBL_478760
Residue:
168
  
Inhibitor
Name:
BDBM552931
Synonyms:
(R)-4-(4-((5,5-dimethyl-2-(3-methylbicyclo[1.1.1]pentan-1-yl)cyclohex-1-enyl)methyl)piperazin-1-yl)-N-(4-(4-(4-hydroxypiperidin-1-yl)-1-(phenylthio)butan-2-ylamino)-3-(trifluoromethylsulfonyl)phenylsulfonyl)benzamide US11344546, Example 48 | US11590126, Example 48
Type:
Small organic molecule
Emp. Form.:
C48H62F3N5O6S3
Mol. Mass.:
958.226
SMILES:
CC12CC(C1)(C2)C1=C(CN2CCN(CC2)c2ccc(cc2)C(=O)NS(=O)(=O)c2ccc(N[C@H](CCN3CCC(O)CC3)CSc3ccccc3)c(c2)S(=O)(=O)C(F)(F)F)CC(C)(C)CC1
: