Target
Bcl2-associated agonist of cell death
Ligand
BDBM555338
Substrate
Meas. Tech.
Homogeneous Time Resolved Fluorescence (HTRF) Assay
IC50
<10±n/a nM
Citation
 Pinchman, JRHuang, PQBunker, KDSit, RKSamatar, AA Benzamide compounds US Patent  US11344546 Publication Date 5/31/2022 
Target
Name:
Bcl2-associated agonist of cell death
Synonyms:
BAD BBC6 Bcl-2-binding component 6 Bcl-XL/Bcl-2-associated death promoter Bcl2-L-8 | Bcl2-antagonist of cell death (BAD)
Type:
PROTEIN
Mol. Mass.:
18393.69
Organism:
Homo sapiens (Human)
Description:
ChEMBL_478760
Residue:
168
  
Inhibitor
Name:
BDBM555338
Synonyms:
(R)-4-(4-((2-(3-(Difluoromethyl)bicyclo[1.1.1]pentan-1-yl)-4,4-dimethylcyclohex-1-en-1-yl)methyl)piperazin-1-yl)-N-((4-((4-(4-(dimethylamino)piperidin-1-yl)-1-(phenylthio)butan-2-yl)amino)-3-((trifluoromethyl)sulfonyl)phenyl)sulfonyl)benzamide | US11344546, Example 62
Type:
Small organic molecule
Emp. Form.:
C50H65F5N6O5S3
Mol. Mass.:
1021.275
SMILES:
CN(C)C1CCN(CC[C@H](CSc2ccccc2)Nc2ccc(cc2S(=O)(=O)C(F)(F)F)S(=O)(=O)NC(=O)c2ccc(cc2)N2CCN(CC3=C(CC(C)(C)CC3)C34CC(C3)(C4)C(F)F)CC2)CC1
: