Target
D(3) dopamine receptor
Ligand
BDBM476834
Substrate
Meas. Tech.
Binding Assay
Ki
0.050±n/a nM
Citation
 Tobinaga, HMasuda, KKasuya, SInagaki, MMasuda, M Nitrogen-containing condensed ring compounds having dopamine D3 antagonistic effect US Patent  US11345716 Publication Date 5/31/2022
Target
Name:
D(3) dopamine receptor
Synonyms:
DOPAMINE D3 DRD3_HUMAN Dopamine D3 receptor (D3) Dopamine receptor Dopamine receptor D3
Type:
Mol. Mass.:
44243.43
Organism:
Homo sapiens (Human)
Description:
Residue:
400
  
Inhibitor
Name:
BDBM476834
Synonyms:
US10870660, Compound III-578 | US11345716, Compound III-578
Type:
Small organic molecule
Emp. Form.:
C23H31F2N5O3S
Mol. Mass.:
495.586
SMILES:
COc1cc(CC(=O)N[C@H]2CC[C@H](CCN3CCc4sc(nc4C3)N3CC(F)(F)C3)CC2)on1
: