Target
D(3) dopamine receptor
Ligand
BDBM556452
Substrate
Meas. Tech.
Binding Assay
Ki
0.014±n/a nM
Citation
 Tobinaga, HMasuda, KKasuya, SInagaki, MMasuda, M Nitrogen-containing condensed ring compounds having dopamine D3 antagonistic effect US Patent  US11345716 Publication Date 5/31/2022
Target
Name:
D(3) dopamine receptor
Synonyms:
DOPAMINE D3 DRD3_HUMAN Dopamine D3 receptor (D3) Dopamine receptor Dopamine receptor D3
Type:
Mol. Mass.:
44243.43
Organism:
Homo sapiens (Human)
Description:
Residue:
400
  
Inhibitor
Name:
BDBM556452
Synonyms:
US11345716, Compound II-057
Type:
Small organic molecule
Emp. Form.:
C26H33F2N5O2S
Mol. Mass.:
517.634
SMILES:
Cc1cn2c(cccc2n1)C(=O)N[C@H]1CC[C@H](CCN2CCc3nc(OCC(F)F)sc3CC2)CC1
: