Target
D(3) dopamine receptor
Ligand
BDBM476924
Substrate
Meas. Tech.
Binding Assay
Ki
0.052±n/a nM
Citation
 Tobinaga, HMasuda, KKasuya, SInagaki, MMasuda, M Nitrogen-containing condensed ring compounds having dopamine D3 antagonistic effect US Patent  US11345716 Publication Date 5/31/2022
Target
Name:
D(3) dopamine receptor
Synonyms:
DOPAMINE D3 DRD3_HUMAN Dopamine D3 receptor (D3) Dopamine receptor Dopamine receptor D3
Type:
Mol. Mass.:
44243.43
Organism:
Homo sapiens (Human)
Description:
Residue:
400
  
Inhibitor
Name:
BDBM476924
Synonyms:
US10870660, Compound II-084 | US11345716, Compound II-084
Type:
Small organic molecule
Emp. Form.:
C24H34F3N5OS2
Mol. Mass.:
529.685
SMILES:
CN(CC(F)(F)F)c1nc2CCN(CC[C@H]3CC[C@@H](CC3)NC(=O)Cc3cnc(C)s3)CCc2s1
: