Target
Replicase polyprotein 1a
Ligand
BDBM556419
Substrate
Meas. Tech.
SARS-CoV-2 Coronavirus 3C Protease FRET Assay
Ki
3.00±n/a nM
Citation
 Owen, DRPettersson, MYReese, MRSammons, MFTuttle, JBVerhoest, PRWei, LYang, QYang, X Nitrile-containing antiviral compounds US Patent  US11351149 Publication Date 6/7/2022 
Target
Name:
Replicase polyprotein 1a
Synonyms:
ORF1a polyprotein Replicase polyprotein 1a pp1a
Type:
Protein
Mol. Mass.:
489977.97
Organism:
2019-nCoV
Description:
P0DTC1
Residue:
4405
  
Inhibitor
Name:
BDBM556419
Synonyms:
US11351149, Example 95
Type:
Small organic molecule
Emp. Form.:
C21H30F3N5O5
Mol. Mass.:
489.4886
SMILES:
COC(=O)N[C@H](C(=O)N([C@@H](C[C@@H]1CCNC1=O)C#N)C(=O)[C@@H]1C[C@H](CN1)C(F)(F)F)C(C)(C)C
: