Target
Cyclin-dependent kinase 4
Ligand
BDBM448950
Substrate
Meas. Tech.
CDK4 Inhibition Assay
IC50
0.080±n/a nM
Citation
 Song, YChen, X Substituted pyrimidines as CDK4/6 inhibitors US Patent  US11351170 Publication Date 6/7/2022 
Target
Name:
Cyclin-dependent kinase 4
Synonyms:
CDK4 Cell division protein kinase 4 PSK-J3
Type:
Enzyme Subunit
Mol. Mass.:
33731.96
Organism:
Homo sapiens (Human)
Description:
P11802
Residue:
303
  
Inhibitor
Name:
BDBM448950
Synonyms:
N-(5-(1-Ethylpiperidine-4-yl)pyridin-2-yl)-5-fluoro-4-(5-fluoro-1,1-dimethyl-2,3-dihydro-1H-benzo[d]pyrrolo[1,2-a]imidazol-7-yl)pyrimidin-2-amine US11351170, Example 4
Type:
Small organic molecule
Emp. Form.:
C28H31F2N7
Mol. Mass.:
503.5894
SMILES:
CCN1CCC(CC1)c1ccc(Nc2ncc(F)c(n2)-c2cc(F)c3nc4CCC(C)(C)n4c3c2)nc1
: