Target
Ectonucleotide pyrophosphatase/phosphodiesterase family member 2
Ligand
BDBM556734
Substrate
Meas. Tech.
Human ATX Enzyme Inhibition Assay
IC50
1.000±n/a nM
Citation
 Hert, JHunziker, DKuehne, HLuebbers, TMartin, REMattei, PNeidhart, WRichter, HRudolph, MPinard, E Phenoxymethyl derivatives US Patent  US11352330 Publication Date 6/7/2022 
Target
Name:
Ectonucleotide pyrophosphatase/phosphodiesterase family member 2
Synonyms:
ATX Autotaxin (ATX) ENPP2 Ectonucleotide Pyrophosphatase/Phosphodiesterase 2 (ENPP2) Extracellular lysophospholipase D PDNP2
Type:
Enzyme
Mol. Mass.:
99007.13
Organism:
Homo sapiens (Human)
Description:
Q13822
Residue:
863
  
Inhibitor
Name:
BDBM556734
Synonyms:
US11352330, Example D50
Type:
Small organic molecule
Emp. Form.:
C18H17ClN4O
Mol. Mass.:
340.807
SMILES:
CC(C)(C)c1cc(Cl)c(cc1OCc1n[nH]c2cnccc12)C#N
: