Target
Bcl-2-like protein 11 [51-76]/Induced myeloid leukemia cell differentiation protein Mcl-1 [171-327]
Ligand
BDBM557715
Substrate
Meas. Tech.
Cell Free Mcl-1: Bim Affinity Assay (Mcl-1 HTRF)
IC50
0.290±n/a nM
Citation
 Brown, SPLi, KLi, YReed, ABLanman, BA Compounds that inhibit Mcl-1 protein US Patent  US11364248 Publication Date 6/21/2022 
Target
Name:
Bcl-2-like protein 11 [51-76]/Induced myeloid leukemia cell differentiation protein Mcl-1 [171-327]
Synonyms:
Bcl-2-like protein 11 [51-76]/Induced myeloid leukemia cell differentiation protein Mcl-1 [171-327] Mcl-1 and BIM | Mcl-1/BIM
Type:
Protein
Mol. Mass.:
Description:
Components:
This complex has 2 components.
Component 1
Name:
Induced myeloid leukemia cell differentiation protein Mcl-1 [171-327]
Synonyms:
BCL2L3 MCL1 Myeloid cell leukemia 1 (Mcl-1)
Type:
Enzyme Catalytic Domain
Mol. Mass.:
17896.13
Organism:
Homo sapiens (Human)
Description:
Q07820[171-327]
Residue:
157
  
Component 2
Name:
Bcl-2-like protein 11 [51-76]
Synonyms:
B2L11_HUMAN BIM Bcl-2-like protein 11 (BIM) (51-76)
Type:
Enzyme Catalytic Domain
Mol. Mass.:
2530.22
Organism:
Homo sapiens (Human)
Description:
O43521[51-76]
Residue:
26
  
Inhibitor
Name:
BDBM557715
Synonyms:
(1S,3'R,6'R,7'S,11'S,12'R)-6-chloro-7'-(trans- 5-hydroxy-1,3-dioxan-2-yl)-11',12'-dimethyl- 3,4-dihydro-2H,15'H-spiro[naphthalene-1,22'- [20]oxa[13]thia[1,14]diazatetracyclo [14.7.2.0~3,6~.0~19,24~]pentacosa[16,18,24] trien]-15'-one 13',13'-dioxide OR US11364248, Example 12 US11364248, Example 14
Type:
Small organic molecule
Emp. Form.:
C36H47ClN2O7S
Mol. Mass.:
687.286
SMILES:
C[C@H]1CCC[C@@H]([C@@H]2CC[C@H]2CN2C[C@@]3(CCCc4cc(Cl)ccc34)COc3ccc(cc23)C(=O)NS(=O)(=O)[C@@H]1C)[C@H]1OC[C@H](O)CO1
: