Target
Potassium voltage-gated channel subfamily KQT member 2
Ligand
BDBM557808
Substrate
Meas. Tech.
FluxOR potassium ion channel assay
EC50
409±n/a nM
Citation
 Chen, HLiang, B P-phenylenediamine derivative as potassium channel regulator and preparation method and medical application thereof US Patent  US11365181 Publication Date 6/21/2022 
Target
Name:
Potassium voltage-gated channel subfamily KQT member 2
Synonyms:
KCNQ (Kv7) potassium channel KCNQ2_HUMAN Neuroblastoma-specific potassium channel subunit alpha KvLQT2 Voltage-gated potassium channel subunit Kv7.2
Type:
PROTEIN
Mol. Mass.:
95883.20
Organism:
Homo sapiens (Human)
Description:
ChEMBL_1457496
Residue:
872
  
Inhibitor
Name:
BDBM557808
Synonyms:
US11365181, Compound 03039
Type:
Small organic molecule
Emp. Form.:
C23H32N2OS
Mol. Mass.:
384.578
SMILES:
Cc1cc2N(CCCCc2s1)c1cc(C)c(NC(=O)CC(C)(C)C)c(C)c1
: