Target
Lysophosphatidic acid receptor 1
Ligand
BDBM557822
Substrate
Meas. Tech.
LPAR1 Membrane Binding Assay
Ki
80.5±n/a nM
Citation
 Ma, TWu, LZhang, X Lysophosphatidic acid receptor 1 (LPAR1) inhibitor compounds US Patent  US11365185 Publication Date 6/21/2022 
Target
Name:
Lysophosphatidic acid receptor 1
Synonyms:
EDG2 LPA-1 LPAR1 Lysophosphatidic acid receptor 1 (LPA1) | Lysophosphatidic acid receptor Edg-2
Type:
Enzyme
Mol. Mass.:
41120.55
Organism:
Homo sapiens (Human)
Description:
Q92633
Residue:
364
  
Inhibitor
Name:
BDBM557822
Synonyms:
1-[4-[5-fluoro-6-[5-[[6-(1-fluoro-1-methyl-ethyl)pyrazin-2-yl]amino]-1-methyl-pyrazol-4-yl]-3-pyridyl]phenyl]cyclopropanecarboxylic Acid Hydrochloride | US11365185, Example 4B
Type:
Small organic molecule
Emp. Form.:
C26H24F2N6O2
Mol. Mass.:
490.5046
SMILES:
Cn1ncc(c1Nc1cncc(n1)C(C)(C)F)-c1ncc(cc1F)-c1ccc(cc1)C1(CC1)C(O)=O
: